Target
Sialidase-4
Ligand
BDBM4706
Substrate
Meas. Tech.
ChEMBL_941620 (CHEMBL2330702)
IC50
13000±n/a nM
Citation
 Zhang, YAlbohy, AZou, YSmutova, VPshezhetsky, AVCairo, CW Identification of selective inhibitors for human neuraminidase isoenzymes using C4,C7-modified 2-deoxy-2,3-didehydro-N-acetylneuraminic acid (DANA) analogues. J Med Chem 56:2948-58 (2013)  
Target
Name:
Sialidase-4
Synonyms:
NEU4 Sialidase 4
Type:
PROTEIN
Mol. Mass.:
51579.82
Organism:
Homo sapiens (Human)
Description:
ChEMBL_960637
Residue:
484
  
Inhibitor
Name:
BDBM4706
Synonyms:
(2R,3R,4S)-3-acetamido-4-hydroxy-2-[(1R,2R)-1,2,3-trihydroxypropyl]-3,4-dihydro-2H-pyran-6-carboxylic acid CHEMBL96712 Neu5Ac2en
Type:
Small organic molecule
Emp. Form.:
C11H17NO8
Mol. Mass.:
291.2546
SMILES:
CC(=O)N[C@@H]1[C@@H](O)C=C(O[C@H]1[C@H](O)[C@H](O)CO)C(O)=O
: