Target
Carbonic anhydrase 2
Ligand
BDBM50428473
Substrate
Meas. Tech.
ChEMBL_943443 (CHEMBL2341887)
Ki
86000±n/a nM
Citation
 Luca, VDVullo, DScozzafava, ACarginale, VRossi, MSupuran, CTCapasso, C Ana-carbonic anhydrase from the thermophilic bacterium Sulphurihydrogenibium azorense is the fastest enzyme known for the CO2 hydration reaction. Bioorg Med Chem 21:1465-9 (2013)  
Target
Name:
Carbonic anhydrase 2
Synonyms:
CA-II CAC Carbonate dehydratase II Carbonic anhydrase 2 (CA-II) Carbonic anhydrase C Carbonic anhydrase II (CA-II) Carbonic anhydrase II (hCA II) | Carbonic anhydrase isoenzyme II (hCA II)
Type:
Enzyme
Mol. Mass.:
29250.71
Organism:
Homo sapiens (Human)
Description:
P00918
Residue:
260
  
Inhibitor
Name:
BDBM50428473
Synonyms:
CHEMBL2079226 | Isoselenocyanate
Type:
Small organic molecule
Emp. Form.:
CHNSe
Mol. Mass.:
105.99
SMILES:
[SeH]C#N
: