Target
Acetylcholinesterase
Ligand
BDBM53072
Substrate
Meas. Tech.
ChEMBL_944079 (CHEMBL2341912)
Ki
>100000±n/a nM
Citation
 Hatfield, MJTsurkan, LGHyatt, JLEdwards, CCLemoff, AJeffries, CYan, BPotter, PM Modulation of esterified drug metabolism by tanshinones from Salvia miltiorrhiza ("Danshen"). J Nat Prod 76:36-44 (2013)  
Target
Name:
Acetylcholinesterase
Synonyms:
ACES_HUMAN Acetylcholinesterase (AChE) | Acetylcholinesterase (human AChE)
Type:
Enzyme
Mol. Mass.:
67792.70
Organism:
Homo sapiens (Human)
Description:
P22303
Residue:
614
  
Inhibitor
Name:
BDBM53072
Synonyms:
(5Z)-3-allyl-5-(3-ethyl-1,3-benzothiazol-2-ylidene)-2-thioxo-thiazolidin-4-one (5Z)-5-(3-ethyl-1,3-benzothiazol-2-ylidene)-3-prop-2-enyl-2-sulfanylidene-4-thiazolidinone MLS001210616 cid_3094418
Type:
Small organic molecule
Emp. Form.:
C15H14N2OS3
Mol. Mass.:
334.479
SMILES:
CCN1\C(Sc2ccccc12)=C1\SC(=S)N(CC=C)C1=O
: