Target
5-hydroxytryptamine receptor 2A
Ligand
BDBM50017452
Substrate
Meas. Tech.
ChEMBL_946116 (CHEMBL2343044)
EC50
1200±n/a nM
Citation
 Jensen, AAPlath, NPedersen, MHIsberg, VKrall, JWellendorph, PStensbøl, TBGloriam, DEKrogsgaard-Larsen, PFrølund, B Design, synthesis, and pharmacological characterization of N- and O-substituted 5,6,7,8-tetrahydro-4H-isoxazolo[4,5-d]azepin-3-ol analogues: novel 5-HT(2A)/5-HT(2C) receptor agonists with pro-cognitive properties. J Med Chem 56:1211-27 (2013)  
Target
Name:
5-hydroxytryptamine receptor 2A
Synonyms:
5-HT-2 5-HT2A 5-hydroxytryptamine receptor 2A (5HT-2A) 5HT2A_HUMAN HTR2A | Serotonin receptor 2A
Type:
undefined
Mol. Mass.:
52607.65
Organism:
Homo sapiens (Human)
Description:
P28223
Residue:
471
  
Inhibitor
Name:
BDBM50017452
Synonyms:
2-chloro-6-piperazin-1-ylpyrazine 6'-Chloro-3,4,5,6-tetrahydro-2H-[1,2']bipyrazinyl(MK-212) L-630,571 MK-212
Type:
Small organic molecule
Emp. Form.:
C8H11ClN4
Mol. Mass.:
198.653
SMILES:
Clc1cncc(n1)N1CCNCC1
: