Target
cGMP-specific 3',5'-cyclic phosphodiesterase
Ligand
BDBM14776
Substrate
Meas. Tech.
ChEMBL_948055 (CHEMBL2345130)
IC50
1±n/a nM
Citation
 Fiorito, JSaeed, FZhang, HStaniszewski, AFeng, YFrancis, YIRao, SThakkar, DMDeng, SXLandry, DWArancio, O Synthesis of quinoline derivatives: discovery of a potent and selective phosphodiesterase 5 inhibitor for the treatment of Alzheimer's disease. Eur J Med Chem 60:285-94 (2013)  
Target
Name:
cGMP-specific 3',5'-cyclic phosphodiesterase
Synonyms:
3',5'-cyclic phosphodiesterase PDE5 PDE5A_HUMAN Phosphodiesterase 5 (PDE5) Phosphodiesterase 5A (PDE5A) cGMP-specific 3',5'-cyclic phosphodiesterase
Type:
Protein
Mol. Mass.:
99975.83
Organism:
Homo sapiens (Human)
Description:
O76074
Residue:
875
  
Inhibitor
Name:
BDBM14776
Synonyms:
2-{2-ethoxy-5-[(4-ethylpiperazine-1-)sulfonyl]phenyl}-5-methyl-7-propyl-3H,4H-imidazo[1,5-a][1,2,4]triazin-4-one Vardenafil | citric acid;2-[2-ethoxy-5-(4-ethylpiperazino)sulfonyl-phenyl]-5-methyl-7-propyl-1H-imidazo[5,1-f][1,2,4]triazin-4-one
Type:
Small organic molecule
Emp. Form.:
C23H32N6O4S
Mol. Mass.:
488.603
SMILES:
CCCc1nc(C)c2n1nc([nH]c2=O)-c1cc(ccc1OCC)S(=O)(=O)N1CCN(CC)CC1
: