Target
Translocator protein
Ligand
BDBM50429217
Substrate
Meas. Tech.
ChEMBL_945637 (CHEMBL2344971)
Ki
0.230000±n/a nM
Citation
 Fukaya, TKodo, TIshiyama, TNishikawa, HBaba, SMasumoto, S Design, synthesis and structure-activity relationship of novel tricyclic benzimidazolone derivatives as potent 18 kDa translocator protein (TSPO) ligands. Bioorg Med Chem 21:1257-67 (2013)  
Target
Name:
Translocator protein
Synonyms:
Benzodiazepine receptors; peripheral & central Mbr PBR Peripheral benzodiazepine receptor (PBR) TSPO_RAT | Tspo
Type:
Mitochondrion membrane protein
Mol. Mass.:
18945.84
Organism:
Rattus norvegicus (rat)
Description:
Competitive binding experiments were performed on rat kidney mitochondrial membranes.
Residue:
169
  
Inhibitor
Name:
BDBM50429217
Synonyms:
CHEMBL2332258
Type:
Small organic molecule
Emp. Form.:
C26H25N3O2
Mol. Mass.:
411.4956
SMILES:
CN(Cc1ccccc1)C(=O)Cn1c2cc(cc3CCCn(c23)c1=O)-c1ccccc1
: