Target
Translocator protein
Ligand
BDBM50429219
Substrate
Meas. Tech.
ChEMBL_945637 (CHEMBL2344971)
Ki
0.210000±n/a nM
Citation
 Fukaya, TKodo, TIshiyama, TNishikawa, HBaba, SMasumoto, S Design, synthesis and structure-activity relationship of novel tricyclic benzimidazolone derivatives as potent 18 kDa translocator protein (TSPO) ligands. Bioorg Med Chem 21:1257-67 (2013)  
Target
Name:
Translocator protein
Synonyms:
Benzodiazepine receptors; peripheral & central Mbr PBR Peripheral benzodiazepine receptor (PBR) TSPO_RAT | Tspo
Type:
Mitochondrion membrane protein
Mol. Mass.:
18945.84
Organism:
Rattus norvegicus (rat)
Description:
Competitive binding experiments were performed on rat kidney mitochondrial membranes.
Residue:
169
  
Inhibitor
Name:
BDBM50429219
Synonyms:
CHEMBL2332256
Type:
Small organic molecule
Emp. Form.:
C24H21N3O3
Mol. Mass.:
399.4418
SMILES:
CN(C(=O)Cn1c2cc(cc3OCCn(c23)c1=O)-c1ccccc1)c1ccccc1
: