Target
Aldo-keto reductase family 1 member C1
Ligand
BDBM50374772
Substrate
Meas. Tech.
ChEMBL_948089 (CHEMBL2345595)
IC50
30800±n/a nM
Citation
 Gazvoda, MBeranic, NTurk, SBurja, BKocevar, MRižner, TLGobec, SPolanc, S 2,3-diarylpropenoic acids as selective non-steroidal inhibitors of type-5 17ß-hydroxysteroid dehydrogenase (AKR1C3). Eur J Med Chem 62:89-97 (2013)  
Target
Name:
Aldo-keto reductase family 1 member C1
Synonyms:
20-alpha-HSD AK1C1_HUMAN Aldo-keto reductase family 1 member C1 (AK1C1) Aldo-keto reductase family 1 member C1 (AKR1C1) DDH High-affinity hepatic bile acid-binding protein | Trans-1,2-dihydrobenzene-1,2-diol dehydrogenase
Type:
Enzyme
Mol. Mass.:
36793.97
Organism:
Homo sapiens (Human)
Description:
Recombinant AKR1C1 enzyme was expressed in E. coli.
Residue:
323
  
Inhibitor
Name:
BDBM50374772
Synonyms:
CHEMBL405127
Type:
Small organic molecule
Emp. Form.:
C16H14O4S
Mol. Mass.:
302.345
SMILES:
CS(=O)(=O)c1ccc(\C=C(\C(O)=O)c2ccccc2)cc1
: