Target
Cannabinoid receptor 2
Ligand
BDBM50429401
Substrate
Meas. Tech.
ChEMBL_949032 (CHEMBL2343202)
Ki
>5000±n/a nM
Citation
 Manca, IMastinu, AOlimpieri, FFalzoi, MSani, MRuiu, SLoriga, GVolonterio, ATambaro, SBottazzi, MEZanda, MPinna, GALazzari, P Novel pyrazole derivatives as neutral CB1 antagonists with significant activity towards food intake. Eur J Med Chem 62:256-69 (2013)  
Target
Name:
Cannabinoid receptor 2
Synonyms:
CANNABINOID CB2 CB2 Cannabinoid CB2 receptor Cannabinoid receptor 2 mCB2
Type:
Enzyme Catalytic Domain
Mol. Mass.:
38220.43
Organism:
MOUSE
Description:
P47936
Residue:
347
  
Inhibitor
Name:
BDBM50429401
Synonyms:
CHEMBL2337202
Type:
Small organic molecule
Emp. Form.:
C23H22Cl3F3N4
Mol. Mass.:
517.802
SMILES:
Cc1c(nn(c1-c1ccc(Cl)cc1)-c1ccc(Cl)cc1Cl)C(NN1CCCCC1)C(F)(F)F
: