Target
Metabotropic glutamate receptor 5
Ligand
BDBM50429417
Substrate
Meas. Tech.
ChEMBL_942305 (CHEMBL2343303)
Ki
3790±n/a nM
Citation
 Zhou, HTopiol, SWGrenon, MJimenez, HNUberti, MASmith, DGBrodbeck, RMChandrasena, GPedersen, HMadsen, JCDoller, DLi, G Discovery and structure-activity relationship of 1,3-cyclohexyl amide derivatives as novel mGluR5 negative allosteric modulators. Bioorg Med Chem Lett 23:1398-406 (2013)  
Target
Name:
Metabotropic glutamate receptor 5
Synonyms:
GPRC1E GRM5_HUMAN metabotropic glutamate 5 | metabotropic glutamate 5a
Type:
Enzyme
Mol. Mass.:
132484.72
Organism:
Homo sapiens (Human)
Description:
Residue:
1212
  
Inhibitor
Name:
BDBM50429417
Synonyms:
CHEMBL2338575
Type:
Small organic molecule
Emp. Form.:
C18H19ClN4O2
Mol. Mass.:
358.822
SMILES:
Clc1cccc(c1)C(=O)N[C@H]1CCC[C@@H](C1)NC(=O)c1ncccn1
: