Target
Metabotropic glutamate receptor 5
Ligand
BDBM50429412
Substrate
Meas. Tech.
ChEMBL_942306 (CHEMBL2343304)
IC50
647±n/a nM
Citation
 Zhou, HTopiol, SWGrenon, MJimenez, HNUberti, MASmith, DGBrodbeck, RMChandrasena, GPedersen, HMadsen, JCDoller, DLi, G Discovery and structure-activity relationship of 1,3-cyclohexyl amide derivatives as novel mGluR5 negative allosteric modulators. Bioorg Med Chem Lett 23:1398-406 (2013)  
Target
Name:
Metabotropic glutamate receptor 5
Synonyms:
GPRC1E GRM5_HUMAN metabotropic glutamate 5 | metabotropic glutamate 5a
Type:
Enzyme
Mol. Mass.:
132484.72
Organism:
Homo sapiens (Human)
Description:
Residue:
1212
  
Inhibitor
Name:
BDBM50429412
Synonyms:
CHEMBL2338582
Type:
Small organic molecule
Emp. Form.:
C20H20ClN3O2
Mol. Mass.:
369.845
SMILES:
Clc1cccc(c1)C1=NC[C@]2(CCC[C@@H](C2)NC(=O)c2ccccn2)O1
: