Target
Metabotropic glutamate receptor 5
Ligand
BDBM50429422
Substrate
Meas. Tech.
ChEMBL_942306 (CHEMBL2343304)
IC50
671±n/a nM
Citation
 Zhou, HTopiol, SWGrenon, MJimenez, HNUberti, MASmith, DGBrodbeck, RMChandrasena, GPedersen, HMadsen, JCDoller, DLi, G Discovery and structure-activity relationship of 1,3-cyclohexyl amide derivatives as novel mGluR5 negative allosteric modulators. Bioorg Med Chem Lett 23:1398-406 (2013)  
Target
Name:
Metabotropic glutamate receptor 5
Synonyms:
GPRC1E GRM5_HUMAN metabotropic glutamate 5 | metabotropic glutamate 5a
Type:
Enzyme
Mol. Mass.:
132484.72
Organism:
Homo sapiens (Human)
Description:
Residue:
1212
  
Inhibitor
Name:
BDBM50429422
Synonyms:
CHEMBL2338563
Type:
Small organic molecule
Emp. Form.:
C20H19ClN4O2
Mol. Mass.:
382.843
SMILES:
Clc1cccc(c1)C(=O)NC1CCCC(C1)NC(=O)c1ncccc1C#N
: