Target
Retinoic acid receptor RXR-alpha
Ligand
BDBM50324896
Substrate
Meas. Tech.
ChEMBL_942867 (CHEMBL2342375)
EC50
3.8±n/a nM
Citation
 Ohsawa, FYamada, SYakushiji, NShinozaki, RNakayama, MKawata, KHagaya, MKobayashi, TKohara, KFurusawa, YFujiwara, COhta, YMakishima, MNaitou, HTai, AYoshikawa, YYasui, HKakuta, H Mechanism of retinoid X receptor partial agonistic action of 1-(3,5,5,8,8-pentamethyl-5,6,7,8-tetrahydro-2-naphthyl)-1H-benzotriazole-5-carboxylic acid and structural development to increase potency. J Med Chem 56:1865-77 (2013)  
Target
Name:
Retinoic acid receptor RXR-alpha
Synonyms:
NR2B1 Nuclear receptor subfamily 4 group A member 2 RXRA Retinoic acid receptor RXR-alpha/gamma Retinoid receptor
Type:
PROTEIN
Mol. Mass.:
50820.38
Organism:
Homo sapiens (Human)
Description:
ChEMBL_1456363
Residue:
462
  
Inhibitor
Name:
BDBM50324896
Synonyms:
6-[N-Ethyl(5,5,8,8-tetramethyl-5,6,7,8-tetrahydro-2-naphthyl)amino]nicotinic acid | CHEMBL1221641
Type:
Small organic molecule
Emp. Form.:
C22H28N2O2
Mol. Mass.:
352.4699
SMILES:
CCN(c1ccc2c(c1)C(C)(C)CCC2(C)C)c1ccc(cn1)C(O)=O
: