Target
Poly [ADP-ribose] polymerase 1
Ligand
BDBM50028962
Substrate
Meas. Tech.
ChEMBL_948351 (CHEMBL2341185)
IC50
1400±n/a nM
Citation
 Narwal, MHaikarainen, TFallarero, AVuorela, PMLehtiö, L Screening and structural analysis of flavones inhibiting tankyrases. J Med Chem 56:3507-17 (2013)  
Target
Name:
Poly [ADP-ribose] polymerase 1
Synonyms:
(ARTD1 or PARP1) 2.4.2.30 ADPRT ARTD1 Human diphtheria toxin-like ADP-ribosyltransferase (ARTD1 or PARP1) NT-PARP-1 PARP1 PPOL Poly [ADP-ribose] polymerase 1 (PARP) Poly [ADP-ribose] polymerase 1 (PARP1) Poly [ADP-ribose] polymerase 1, 28-kDa form Poly [ADP-ribose] polymerase 1, processed C-terminus Poly [ADP-ribose] polymerase-1 Poly(ADP-ribose) polymerase-1 (ARTD1/PARP1) Protein poly-ADP-ribosyltransferase PARP1 | Synonyms=ADPRT
Type:
Mol. Mass.:
113114.22
Organism:
Homo sapiens (Human)
Description:
P09874
Residue:
1014
  
Inhibitor
Name:
BDBM50028962
Synonyms:
CHEMBL275638 | flavone
Type:
Small organic molecule
Emp. Form.:
C15H10O2
Mol. Mass.:
222.2387
SMILES:
O=c1cc(oc2ccccc12)-c1ccccc1
: