Target
Extracellular calcium-sensing receptor
Ligand
BDBM50432120
Substrate
Meas. Tech.
ChEMBL_950625 (CHEMBL2352375)
EC50
150±n/a nM
Citation
 Temal, TJary, HAuberval, MLively, SGuédin, DVevert, JPDeprez, P New potent calcimimetics: I. Discovery of a series of novel trisubstituted ureas. Bioorg Med Chem Lett 23:2451-4 (2013)  
Target
Name:
Extracellular calcium-sensing receptor
Synonyms:
CASR CaR Calcium-sensing receptor (CaSR) GPRC2A Parathyroid Cell calcium-sensing receptor Synonyms=GPRC2A | hCasR
Type:
Protein
Mol. Mass.:
120663.13
Organism:
Homo sapiens (Human)
Description:
P41180
Residue:
1078
  
Inhibitor
Name:
BDBM50432120
Synonyms:
CHEMBL2349602
Type:
Small organic molecule
Emp. Form.:
C32H35N3O3
Mol. Mass.:
509.6386
SMILES:
O=C(Nc1cccc(c1)-c1ccco1)N(CCC(c1ccccc1)c1ccccc1)CCN1CCOCC1
: