Target
Extracellular calcium-sensing receptor
Ligand
BDBM50432168
Substrate
Meas. Tech.
ChEMBL_950625 (CHEMBL2352375)
EC50
15000±n/a nM
Citation
 Temal, TJary, HAuberval, MLively, SGuédin, DVevert, JPDeprez, P New potent calcimimetics: I. Discovery of a series of novel trisubstituted ureas. Bioorg Med Chem Lett 23:2451-4 (2013)  
Target
Name:
Extracellular calcium-sensing receptor
Synonyms:
CASR CaR Calcium-sensing receptor (CaSR) GPRC2A Parathyroid Cell calcium-sensing receptor Synonyms=GPRC2A | hCasR
Type:
Protein
Mol. Mass.:
120663.13
Organism:
Homo sapiens (Human)
Description:
P41180
Residue:
1078
  
Inhibitor
Name:
BDBM50432168
Synonyms:
CHEMBL2346767
Type:
Small organic molecule
Emp. Form.:
C23H24N2O2
Mol. Mass.:
360.4489
SMILES:
COc1ccc(NC(=O)NCCC(c2ccccc2)c2ccccc2)cc1
: