Target
5-hydroxytryptamine receptor 2C
Ligand
BDBM35254
Substrate
Meas. Tech.
ChEMBL_950921 (CHEMBL2349994)
IC50
71±n/a nM
Citation
 Gao, MShi, ZWang, MZheng, QH [11C]olanzapine, radiosynthesis and lipophilicity of a new potential PET 5-HT2 and D2 receptor radioligand. Bioorg Med Chem Lett 23:1953-6 (2013)  
Target
Name:
5-hydroxytryptamine receptor 2C
Synonyms:
5-HT-2C 5-HT2C-INI 5-HTR2C 5-hydroxytryptamine receptor 2C (5-HT-2C) 5HT-1C HTR1C Serotonin (5-HT3) receptor Serotonin Receptor 2C
Type:
G Protein-Coupled Receptor (GPCR)
Mol. Mass.:
51836.79
Organism:
Homo sapiens (Human)
Description:
P28335
Residue:
458
  
Inhibitor
Name:
BDBM35254
Synonyms:
2-methyl-4-(4-methylpiperazin-1-yl)-10H-thieno[2,3-b][1,5]benzodiazepine Olansek Zyprexa | olanzapine
Type:
Small organic molecule
Emp. Form.:
C17H20N4S
Mol. Mass.:
312.432
SMILES:
CN1CCN(CC1)C1=Nc2ccccc2Nc2sc(C)cc12
: