Target
Cytochrome P450 3A4
Ligand
BDBM50432396
Substrate
Meas. Tech.
ChEMBL_952828 (CHEMBL2351333)
IC50
>50000±n/a nM
Citation
 Reeves, EKHoffman, EPNagaraju, KDamsker, JMMcCall, JM VBP15: preclinical characterization of a novel anti-inflammatory delta 9,11 steroid. Bioorg Med Chem 21:2241-9 (2013)  
Target
Name:
Cytochrome P450 3A4
Synonyms:
Albendazole monooxygenase CP3A4_HUMAN CYP3A4 CYPIIIA4 Cytochrome P450 3A4 (CYP3A4) Nifedipine oxidase Taurochenodeoxycholate 6-alpha-hydroxylase
Type:
Enzyme
Mol. Mass.:
57349.57
Organism:
Homo sapiens (Human)
Description:
Residue:
503
  
Inhibitor
Name:
BDBM50432396
Synonyms:
CHEMBL2348780
Type:
Small organic molecule
Emp. Form.:
C22H28O4
Mol. Mass.:
356.4553
SMILES:
C[C@@H]1C[C@H]2[C@@H]3CCC4=CC(=O)C=C[C@]4(C)C3=CC[C@]2(C)[C@@]1(O)C(=O)CO
: