Target
Extracellular calcium-sensing receptor
Ligand
BDBM50432957
Substrate
Meas. Tech.
ChEMBL_957699 (CHEMBL2378664)
EC50
450±n/a nM
Citation
 Deprez, PTemal, TJary, HAuberval, MLively, SGuédin, DVevert, JP New potent calcimimetics: II. Discovery of benzothiazole trisubstituted ureas. Bioorg Med Chem Lett 23:2455-9 (2013)  
Target
Name:
Extracellular calcium-sensing receptor
Synonyms:
CASR CaR Calcium-sensing receptor (CaSR) GPRC2A Parathyroid Cell calcium-sensing receptor Synonyms=GPRC2A | hCasR
Type:
Protein
Mol. Mass.:
120663.13
Organism:
Homo sapiens (Human)
Description:
P41180
Residue:
1078
  
Inhibitor
Name:
BDBM50432957
Synonyms:
CHEMBL2377728
Type:
Small organic molecule
Emp. Form.:
C26H31N5O2
Mol. Mass.:
445.5566
SMILES:
O=C(Nc1cnccn1)N(CCC(c1ccccc1)c1ccccc1)CCN1CCOCC1
: