Target
Free fatty acid receptor 1
Ligand
BDBM50362690
Substrate
Meas. Tech.
ChEMBL_960925 (CHEMBL2388543)
EC50
60±n/a nM
Citation
 Wang, YLiu, JJDransfield, PJZhu, LWang, ZDu, XJiao, XSu, YLi, ARBrown, SPKasparian, AVimolratana, MYu, MPattaropong, VHouze, JBSwaminath, GTran, TNguyen, KGuo, QZhang, JZhuang, RLi, FMiao, LBartberger, MDCorrell, TLChow, DWong, SLuo, JLin, DCMedina, JC Discovery and Optimization of Potent GPR40 Full Agonists Containing Tricyclic Spirocycles. ACS Med Chem Lett 4:551-5 (2013)  
Target
Name:
Free fatty acid receptor 1
Synonyms:
FFAR1 G-protein Coupled Receptor 40 | GPR40
Type:
G Protein-Coupled Receptor (GPCR)
Mol. Mass.:
31473.32
Organism:
Homo sapiens (Human)
Description:
O14842
Residue:
300
  
Inhibitor
Name:
BDBM50362690
Synonyms:
AMG-837 | CHEMBL1829173
Type:
Small organic molecule
Emp. Form.:
C26H21F3O3
Mol. Mass.:
438.4383
SMILES:
CC#C[C@@H](CC(O)=O)c1ccc(OCc2cccc(c2)-c2ccc(cc2)C(F)(F)F)cc1
: