Target
Cystic fibrosis transmembrane conductance regulator
Ligand
BDBM50434312
Substrate
Meas. Tech.
ChEMBL_960597 (CHEMBL2389886)
IC50
4.0±n/a nM
Citation
 Snyder, DSTradtrantip, LBattula, SYao, CPhuan, PWFettinger, JCKurth, MJVerkman, AS ABSOLUTE CONFIGURATION AND BIOLOGICAL PROPERTIES OF ENANTIOMERS OF CFTR INHIBITOR BPO-27. ACS Med Chem Lett 4:456-459 (2013)  
Target
Name:
Cystic fibrosis transmembrane conductance regulator
Synonyms:
ABCC7 CFTR Channel conductance-controlling ATPase | cAMP-dependent chloride channel
Type:
Enzyme Catalytic Domain
Mol. Mass.:
168171.30
Organism:
Homo sapiens (Human)
Description:
gi_90421313
Residue:
1480
  
Inhibitor
Name:
BDBM50434312
Synonyms:
CHEMBL2386374
Type:
Small organic molecule
Emp. Form.:
C26H17BrN3O6
Mol. Mass.:
547.334
SMILES:
Cn1c2c3[C@@H](Oc4ccc(cc4-n3c(-c3ccccc3)c2c(=O)n(C)c1=O)C([O-])=O)c1ccc(Br)o1
: