Target
P2Y purinoceptor 1
Ligand
BDBM50435011
Substrate
Meas. Tech.
ChEMBL_963233 (CHEMBL2388104)
EC50
7.0±n/a nM
Citation
 Azran, SFörster, DDanino, ONadel, YReiser, GFischer, B Highly efficient biocompatible neuroprotectants with dual activity as antioxidants and P2Y receptor agonists. J Med Chem 56:4938-52 (2013)  
Target
Name:
P2Y purinoceptor 1
Synonyms:
ATP receptor P2RY1_HUMAN P2Y1 Purinergic receptor P2Y1
Type:
Enzyme
Mol. Mass.:
42090.25
Organism:
Homo sapiens (Human)
Description:
P47900
Residue:
373
  
Inhibitor
Name:
BDBM50435011
Synonyms:
CHEMBL2386491
Type:
Small organic molecule
Emp. Form.:
C10H16BClN5O9P2
Mol. Mass.:
458.474
SMILES:
[BH3-][P@@](=O)(OC[C@H]1O[C@H]([C@H](O)[C@@H]1O)n1cnc2c(N)nc(Cl)nc12)OP(O)(O)=O
: