Target
Cholinesterase
Ligand
BDBM50435595
Substrate
Meas. Tech.
ChEMBL_964212 (CHEMBL2395025)
IC50
>100000±n/a nM
Citation
 Razavi, SFKhoobi, MNadri, HSakhteman, AMoradi, AEmami, SForoumadi, AShafiee, A Synthesis and evaluation of 4-substituted coumarins as novel acetylcholinesterase inhibitors. Eur J Med Chem 64:252-9 (2013)  
Target
Name:
Cholinesterase
Synonyms:
BCHE CHLE_HORSE | Cholinesterase
Type:
Enzyme
Mol. Mass.:
65643.35
Organism:
Equus caballus (Horse)
Description:
P81908
Residue:
574
  
Inhibitor
Name:
BDBM50435595
Synonyms:
CHEMBL2393503
Type:
Small organic molecule
Emp. Form.:
C23H24N2O4
Mol. Mass.:
392.4477
SMILES:
O=C(CCCOc1cc(=O)oc2ccccc12)N1CCN(CC1)c1ccccc1
: