Target
Cholinesterase
Ligand
BDBM50435598
Substrate
Meas. Tech.
ChEMBL_964212 (CHEMBL2395025)
IC50
76000±n/a nM
Citation
 Razavi, SFKhoobi, MNadri, HSakhteman, AMoradi, AEmami, SForoumadi, AShafiee, A Synthesis and evaluation of 4-substituted coumarins as novel acetylcholinesterase inhibitors. Eur J Med Chem 64:252-9 (2013)  
Target
Name:
Cholinesterase
Synonyms:
BCHE CHLE_HORSE | Cholinesterase
Type:
Enzyme
Mol. Mass.:
65643.35
Organism:
Equus caballus (Horse)
Description:
P81908
Residue:
574
  
Inhibitor
Name:
BDBM50435598
Synonyms:
CHEMBL2393500
Type:
Small organic molecule
Emp. Form.:
C21H19FN2O4
Mol. Mass.:
382.385
SMILES:
Fc1ccc(cc1)N1CCN(CC1)C(=O)COc1cc(=O)oc2ccccc12
: