Target
Acetylcholinesterase
Ligand
BDBM50435598
Substrate
Meas. Tech.
ChEMBL_964213 (CHEMBL2395026)
IC50
2100±n/a nM
Citation
 Razavi, SFKhoobi, MNadri, HSakhteman, AMoradi, AEmami, SForoumadi, AShafiee, A Synthesis and evaluation of 4-substituted coumarins as novel acetylcholinesterase inhibitors. Eur J Med Chem 64:252-9 (2013)  
Target
Name:
Acetylcholinesterase
Synonyms:
ACES_ELEEL Acetylcholinesterase (EeAChE) | ache
Type:
Enzyme
Mol. Mass.:
71812.79
Organism:
Electrophorus electricus (Electric eel)
Description:
Residue:
633
  
Inhibitor
Name:
BDBM50435598
Synonyms:
CHEMBL2393500
Type:
Small organic molecule
Emp. Form.:
C21H19FN2O4
Mol. Mass.:
382.385
SMILES:
Fc1ccc(cc1)N1CCN(CC1)C(=O)COc1cc(=O)oc2ccccc12
: