Target
Cholinesterase
Ligand
BDBM50435602
Substrate
Meas. Tech.
ChEMBL_964212 (CHEMBL2395025)
IC50
>100000±n/a nM
Citation
 Razavi, SFKhoobi, MNadri, HSakhteman, AMoradi, AEmami, SForoumadi, AShafiee, A Synthesis and evaluation of 4-substituted coumarins as novel acetylcholinesterase inhibitors. Eur J Med Chem 64:252-9 (2013)  
Target
Name:
Cholinesterase
Synonyms:
BCHE CHLE_HORSE | Cholinesterase
Type:
Enzyme
Mol. Mass.:
65643.35
Organism:
Equus caballus (Horse)
Description:
P81908
Residue:
574
  
Inhibitor
Name:
BDBM50435602
Synonyms:
CHEMBL2390990
Type:
Small organic molecule
Emp. Form.:
C23H25NO6
Mol. Mass.:
411.4477
SMILES:
COc1ccc(CCNC(=O)CCCOc2cc(=O)oc3ccccc23)cc1OC
: