Target
Aurora kinase A
Ligand
BDBM50435696
Substrate
Meas. Tech.
ChEMBL_965038 (CHEMBL2396200)
IC50
86±n/a nM
Citation
 Zheng, YZheng, MLing, XLiu, YXue, YAn, LGu, NJi, MJin, M Design, synthesis, quantum chemical studies and biological activity evaluation of pyrazole-benzimidazole derivatives as potent Aurora A/B kinase inhibitors. Bioorg Med Chem Lett 23:3523-30 (2013)  
Target
Name:
Aurora kinase A
Synonyms:
AIK ARK1 AURKA AYK1 Aurora kinase A (AURA) Aurora kinase A (Aurora A) Aurora-related kinase 1 BTAK Breast-tumor-amplified kinase STK15 Serine/threonine kinase 15 Serine/threonine-protein kinase aurora A hARK1
Type:
Serine/threonine-protein kinase
Mol. Mass.:
45830.98
Organism:
Homo sapiens (Human)
Description:
O14965
Residue:
403
  
Inhibitor
Name:
BDBM50435696
Synonyms:
CHEMBL2392109
Type:
Small organic molecule
Emp. Form.:
C20H23ClN8S
Mol. Mass.:
442.968
SMILES:
CCN(CC)Cc1ccc2nc([nH]c2c1)-c1n[nH]cc1Nc1cc(Cl)nc(SC)n1
: