Target
Sigma non-opioid intracellular receptor 1
Ligand
BDBM50435860
Substrate
Meas. Tech.
ChEMBL_963768 (CHEMBL2395767)
Ki
30±n/a nM
Citation
 Sadeghzadeh, MSheibani, SGhandi, MDaha, FJAmanlou, MArjmand, MHasani Bozcheloie, A Synthesis and receptor binding studies of novel 4,4-disubstituted arylalkyl/arylalkylsulfonyl piperazine and piperidine-based derivatives as a new class ofs1 ligands. Eur J Med Chem 64:488-97 (2013)  
Target
Name:
Sigma non-opioid intracellular receptor 1
Synonyms:
OPRS1 SIGMAR1 Sigma non-opioid intracellular receptor 1 Sigma1-receptor Sterol isomerase-like protein
Type:
Protein
Mol. Mass.:
25307.17
Organism:
Cavia porcellus (Guinea pig)
Description:
Q60492
Residue:
223
  
Inhibitor
Name:
BDBM50435860
Synonyms:
CHEMBL2391060
Type:
Small organic molecule
Emp. Form.:
C18H21BrN2O2S
Mol. Mass.:
409.341
SMILES:
Brc1cccc(CS(=O)(=O)N2CCN(Cc3ccccc3)CC2)c1
: