Target
Sigma non-opioid intracellular receptor 1
Ligand
BDBM50435884
Substrate
Meas. Tech.
ChEMBL_963768 (CHEMBL2395767)
Ki
38±n/a nM
Citation
 Sadeghzadeh, MSheibani, SGhandi, MDaha, FJAmanlou, MArjmand, MHasani Bozcheloie, A Synthesis and receptor binding studies of novel 4,4-disubstituted arylalkyl/arylalkylsulfonyl piperazine and piperidine-based derivatives as a new class ofs1 ligands. Eur J Med Chem 64:488-97 (2013)  
Target
Name:
Sigma non-opioid intracellular receptor 1
Synonyms:
OPRS1 SIGMAR1 Sigma non-opioid intracellular receptor 1 Sigma1-receptor Sterol isomerase-like protein
Type:
Protein
Mol. Mass.:
25307.17
Organism:
Cavia porcellus (Guinea pig)
Description:
Q60492
Residue:
223
  
Inhibitor
Name:
BDBM50435884
Synonyms:
CHEMBL2391057
Type:
Small organic molecule
Emp. Form.:
C20H26N2O
Mol. Mass.:
310.4332
SMILES:
OC[C@@H]1CN(CCc2ccccc2)CCN1Cc1ccccc1
: