Target
Mineralocorticoid receptor
Ligand
BDBM50437600
Substrate
Meas. Tech.
ChEMBL_974220 (CHEMBL2411354)
IC50
3000±n/a nM
Citation
 Yang, CShen, HCWu, ZChu, HDCox, JMBalsells, JCrespo, ABrown, PZamlynny, BWiltsie, JClemas, JGibson, JContino, LLisnock, JZhou, GGarcia-Calvo, MBateman, TXu, LTong, XCrook, MSinclair, P Discovery of novel oxazolidinedione derivatives as potent and selective mineralocorticoid receptor antagonists. Bioorg Med Chem Lett 23:4388-92 (2013)  
Target
Name:
Mineralocorticoid receptor
Synonyms:
MCR MLR NR3C2 | Nuclear receptor subfamily 3 group C member 2
Type:
Enzyme
Mol. Mass.:
107076.42
Organism:
Homo sapiens (Human)
Description:
P08235
Residue:
984
  
Inhibitor
Name:
BDBM50437600
Synonyms:
CHEMBL2407864
Type:
Small organic molecule
Emp. Form.:
C29H25N3O4
Mol. Mass.:
479.5265
SMILES:
C[C@@H](N1C(=O)O[C@](Cc2ccccc2)(C(=O)NCc2cccc3cnccc23)C1=O)c1ccccc1
: