Target
Ribonuclease pancreatic
Ligand
BDBM50438451
Substrate
Meas. Tech.
ChEMBL_975987 (CHEMBL2415636)
Ki
95000±n/a nM
Citation
 Datta, DSamanta, ADasgupta, SPathak, T 3'-Oxo-, amino-, thio- and sulfone-acetic acid modified thymidines: effect of increased acidity on ribonuclease A inhibition. Bioorg Med Chem 21:4634-45 (2013)  
Target
Name:
Ribonuclease pancreatic
Synonyms:
CAM-RNase A RNASE1 RNS1
Type:
Enzyme
Mol. Mass.:
16468.79
Organism:
Bison bison (American bison)
Description:
carboxamidomethylated RNase A
Residue:
150
  
Inhibitor
Name:
BDBM50438451
Synonyms:
CHEMBL2414510
Type:
Small organic molecule
Emp. Form.:
C12H16N2O8S
Mol. Mass.:
348.329
SMILES:
Cc1cn([C@H]2C[C@H](O)[C@@H](CS(=O)(=O)CC(O)=O)O2)c(=O)[nH]c1=O
: