Target
Orexin/Hypocretin receptor type 1
Ligand
BDBM50438823
Substrate
Meas. Tech.
ChEMBL_977031 (CHEMBL2416555)
Ki
1.000000±n/a nM
Citation
 Lebold, TPBonaventure, PShireman, BT Selective orexin receptor antagonists. Bioorg Med Chem Lett 23:4761-9 (2013)  
Target
Name:
Orexin/Hypocretin receptor type 1
Synonyms:
HCRTR1 OX1R_HUMAN Orexin receptor type 1 (OR 1) Orexin receptor type 1 (OX1) Orexin receptor type 1 (OxR1) | Ox1r
Type:
Protein
Mol. Mass.:
47554.50
Organism:
Homo sapiens (Human)
Description:
O43613
Residue:
425
  
Inhibitor
Name:
BDBM50438823
Synonyms:
CHEMBL2413366
Type:
Small organic molecule
Emp. Form.:
C22H25N5O2
Mol. Mass.:
391.4662
SMILES:
C[C@H]1[C@H](COc2ccccn2)CCCN1C(=O)c1cc(C)ccc1-n1nccn1
: