Target
Substance-P receptor
Ligand
BDBM50439327
Substrate
Meas. Tech.
ChEMBL_977575 (CHEMBL2423357)
Ki
0.005700±n/a nM
Citation
 Nair, PYamamoto, TLargent-Milnes, TMCowell, SKulkarni, VMoye, SNavratilova, EDavis, PMa, SWVanderah, TWLai, JPorreca, FHruby, VJ Truncation of the peptide sequence in bifunctional ligands with mu and delta opioid receptor agonist and neurokinin 1 receptor antagonist activities. Bioorg Med Chem Lett 23:4975-8 (2013)  
Target
Name:
Substance-P receptor
Synonyms:
NK-1 receptor NK1 Receptor NK1R_HUMAN Neurokinin-1 (NK-1) SPR TACR1 Tachykinin receptor 1 (NK1) | tachykinin
Type:
G Protein-Coupled Receptor (GPCR)
Mol. Mass.:
46254.43
Organism:
Homo sapiens (Human)
Description:
P25103
Residue:
407
  
Inhibitor
Name:
BDBM50439327
Synonyms:
CHEMBL2419544
Type:
Small organic molecule
Emp. Form.:
C45H45F6N7O8
Mol. Mass.:
925.8713
SMILES:
C[C@@H](NC(=O)[C@@H](N)Cc1ccc(O)cc1)C(=O)NCC(=O)N[C@@H](Cc1ccccc1)C(=O)NCC(=O)N[C@@H](Cc1c[nH]c2ccccc12)C(=O)OCc1cc(cc(c1)C(F)(F)F)C(F)(F)F
: