Target
Coagulation factor VII/Tissue factor
Ligand
BDBM50440849
Substrate
Meas. Tech.
ChEMBL_984127 (CHEMBL2434648)
Ki
1.3±n/a nM
Citation
 Glunz, PWZhang, XZou, YDelucca, INirschl, AHCheng, XWeigelt, CACheney, DLWei, AAnumula, RLuettgen, JMRendina, ARHarpel, MLuo, GKnabb, RWong, PCWexler, RRPriestley, ES Nonbenzamidine acylsulfonamide tissue factor-factor VIIa inhibitors. Bioorg Med Chem Lett 23:5244-8 (2013)  
Target
Name:
Coagulation factor VII/Tissue factor
Synonyms:
Coagulation factor III/Factor VIIa (fVIIa) | Coagulation factor III/VII
Type:
Mol. Mass.:
Description:
ASSAY_ID of EBI is 69535
Components:
This complex has 2 components.
Component 1
Name:
Tissue factor
Synonyms:
CD_antigen=CD142 Coagulation factor VII/tissue factor TF Thromboplastin | Tissue factor
Type:
PROTEIN
Mol. Mass.:
33067.61
Organism:
Homo sapiens (Human)
Description:
ChEMBL_936735
Residue:
295
  
Component 2
Name:
Coagulation factor VII
Synonyms:
Eptacog alfa FA7_HUMAN Factor VIIa (fVIIa) SPCA serum prothrombin conversion accelerator
Type:
Enzyme
Mol. Mass.:
51599.89
Organism:
Homo sapiens (Human)
Description:
Residue:
466
  
Inhibitor
Name:
BDBM50440849
Synonyms:
CHEMBL2431588
Type:
Small organic molecule
Emp. Form.:
C26H30N4O5S
Mol. Mass.:
510.605
SMILES:
CCOc1cc(ccc1OC(C)C)C(Nc1ccc(cc1)C(N)=N)C(=O)NS(=O)(=O)c1ccccc1
: