Target
Orexin receptor type 2
Ligand
BDBM50441372
Substrate
Meas. Tech.
ChEMBL_987348 (CHEMBL2438198)
Ki
0.166000±n/a nM
Citation
 Betschart, CHintermann, SBehnke, DCotesta, SFendt, MGee, CEJacobson, LHLaue, GOfner, SChaudhari, VBadiger, SPandit, CWagner, JHoyer, D Identification of a novel series of orexin receptor antagonists with a distinct effect on sleep architecture for the treatment of insomnia. J Med Chem 56:7590-607 (2013)  
Target
Name:
Orexin receptor type 2
Synonyms:
HCRTR2 OX2R_HUMAN Orexin receptor type 2 (OR-2) Orexin receptor type 2 (OX2R) Ox-2-R | Ox2-R
Type:
Protein
Mol. Mass.:
50710.53
Organism:
Homo sapiens (Human)
Description:
O43614
Residue:
444
  
Inhibitor
Name:
BDBM50441372
Synonyms:
CHEMBL2435400
Type:
Small organic molecule
Emp. Form.:
C25H31N5O2
Mol. Mass.:
433.5459
SMILES:
COc1ccc2[nH]cc(CN3CCCC4(CCN(CC4)c4nc(C)cc(C)n4)C3=O)c2c1
: