Target
Cytochrome P450 2C9
Ligand
BDBM50441506
Substrate
Meas. Tech.
ChEMBL_988444 (CHEMBL2437986)
IC50
>30000±n/a nM
Citation
 de Lera Ruiz, MZheng, JBerlin, MYMcCormick, KDAslanian, RGWest, RHwa, JLachowicz, Jvan Heek, M Bicyclic and tricyclic heterocycle derivatives as histamine H3 receptor antagonists for the treatment of obesity. Bioorg Med Chem Lett 23:6004-9 (2013)  
Target
Name:
Cytochrome P450 2C9
Synonyms:
(R)-limonene 6-monooxygenase CP2C9_HUMAN CYP2C9 Cytochrome P450 2C9 (CYP2C9 ) P-450MP P450 PB-1 | S-mephenytoin 4-hydroxylase
Type:
Enzyme
Mol. Mass.:
55636.33
Organism:
Homo sapiens (Human)
Description:
P11712
Residue:
490
  
Inhibitor
Name:
BDBM50441506
Synonyms:
CHEMBL2436625
Type:
Small organic molecule
Emp. Form.:
C28H38FN5O2
Mol. Mass.:
495.632
SMILES:
COc1ccc2CN(CCCc2c1)C1CCN(CC1)C(=O)C1(F)CCN(Cc2ccnc(N)c2)CC1
: