Target
Cytochrome P450 2D6
Ligand
BDBM50441506
Substrate
Meas. Tech.
ChEMBL_988446 (CHEMBL2437988)
IC50
>30000±n/a nM
Citation
 de Lera Ruiz, MZheng, JBerlin, MYMcCormick, KDAslanian, RGWest, RHwa, JLachowicz, Jvan Heek, M Bicyclic and tricyclic heterocycle derivatives as histamine H3 receptor antagonists for the treatment of obesity. Bioorg Med Chem Lett 23:6004-9 (2013)  
Target
Name:
Cytochrome P450 2D6
Synonyms:
CP2D6_HUMAN CYP2DL1 Cytochrome P450 2D6 (CYP2D6) P450-DB1
Type:
Protein
Mol. Mass.:
55774.82
Organism:
Homo sapiens (Human)
Description:
P10635
Residue:
497
  
Inhibitor
Name:
BDBM50441506
Synonyms:
CHEMBL2436625
Type:
Small organic molecule
Emp. Form.:
C28H38FN5O2
Mol. Mass.:
495.632
SMILES:
COc1ccc2CN(CCCc2c1)C1CCN(CC1)C(=O)C1(F)CCN(Cc2ccnc(N)c2)CC1
: