Target
Metabotropic glutamate receptor 5
Ligand
BDBM50442525
Substrate
Meas. Tech.
ChEMBL_990431 (CHEMBL2446282)
IC50
49±n/a nM
Citation
 Felts, ASRodriguez, ALMorrison, RDVenable, DFManka, JTBates, BSBlobaum, ALByers, FWDaniels, JSNiswender, CMJones, CKConn, PJLindsley, CWEmmitte, KA Discovery of VU0409106: A negative allosteric modulator of mGlu5 with activity in a mouse model of anxiety. Bioorg Med Chem Lett 23:5779-85 (2013)  
Target
Name:
Metabotropic glutamate receptor 5
Synonyms:
GPRC1E GRM5_HUMAN metabotropic glutamate 5 | metabotropic glutamate 5a
Type:
Enzyme
Mol. Mass.:
132484.72
Organism:
Homo sapiens (Human)
Description:
Residue:
1212
  
Inhibitor
Name:
BDBM50442525
Synonyms:
CHEMBL2440659 | US8796295, Table 2: Compound: 1
Type:
Small organic molecule
Emp. Form.:
C15H11FN4O2S
Mol. Mass.:
330.337
SMILES:
Cc1csc(NC(=O)c2cc(F)cc(Oc3cncnc3)c2)n1
: