Target
D(1A) dopamine receptor
Ligand
BDBM50442746
Substrate
Meas. Tech.
ChEMBL_989369 (CHEMBL2443404)
Ki
21000±n/a nM
Citation
 Banerjee, AMaschauer, SHübner, HGmeiner, PPrante, O Click chemistry based synthesis of dopamine D4 selective receptor ligands for the selection of potential PET tracers. Bioorg Med Chem Lett 23:6079-82 (2013)  
Target
Name:
D(1A) dopamine receptor
Synonyms:
DRD1 Dopamine D1 receptor
Type:
PROTEIN
Mol. Mass.:
49269.92
Organism:
Sus scrofa
Description:
ChEMBL_1460140
Residue:
446
  
Inhibitor
Name:
BDBM50442746
Synonyms:
CHEMBL2443010
Type:
Small organic molecule
Emp. Form.:
C18H26FN5O2
Mol. Mass.:
363.4297
SMILES:
COc1ccccc1N1CCN(Cc2cn(CCOCCF)nn2)CC1
: