Target
D(3) dopamine receptor
Ligand
BDBM50442751
Substrate
Meas. Tech.
ChEMBL_989366 (CHEMBL2443401)
Ki
2800±n/a nM
Citation
 Banerjee, AMaschauer, SHübner, HGmeiner, PPrante, O Click chemistry based synthesis of dopamine D4 selective receptor ligands for the selection of potential PET tracers. Bioorg Med Chem Lett 23:6079-82 (2013)  
Target
Name:
D(3) dopamine receptor
Synonyms:
DOPAMINE D3 DRD3_HUMAN Dopamine D3 receptor (D3) Dopamine receptor Dopamine receptor D3
Type:
Mol. Mass.:
44243.43
Organism:
Homo sapiens (Human)
Description:
Residue:
400
  
Inhibitor
Name:
BDBM50442751
Synonyms:
CHEMBL2443005
Type:
Small organic molecule
Emp. Form.:
C23H28FN5O2
Mol. Mass.:
425.4991
SMILES:
COc1ccccc1N1CCN(Cc2cn(nn2)-c2ccc(OCCCF)cc2)CC1
: