Target
5-hydroxytryptamine receptor 4
Ligand
BDBM50399619
Substrate
Meas. Tech.
ChEMBL_1278685 (CHEMBL3095863)
Ki
20±n/a nM
Citation
 Fontenelle, CQWang, ZFossey, CCailly, TLinclau, BFabis, F Design of fluorinated 5-HT(4)R antagonists: influence of the basicity and lipophilicity toward the 5-HT(4)R binding affinities. Bioorg Med Chem 21:7529-38 (2013)  
Target
Name:
5-hydroxytryptamine receptor 4
Synonyms:
5-HT4 5HT4R_CAVPO Serotonin 4 (5-HT4) receptor
Type:
Enzyme Catalytic Domain
Mol. Mass.:
43735.29
Organism:
GUINEA PIG
Description:
5-HT4 HTR4 GUINEA PIG::O70528
Residue:
388
  
Inhibitor
Name:
BDBM50399619
Synonyms:
CHEMBL2181189
Type:
Small organic molecule
Emp. Form.:
C22H25FN2O
Mol. Mass.:
352.4451
SMILES:
CCCN1CCC(COc2nc3c(F)cccc3c3ccccc23)CC1
: