Target
Nuclear receptor ROR-gamma
Ligand
BDBM50444338
Substrate
Meas. Tech.
ChEMBL_1279576 (CHEMBL3097489)
EC50
911±n/a nM
Citation
 Fauber, BPde Leon Boenig, GBurton, BEidenschenk, CEverett, CGobbi, AHymowitz, SGJohnson, ARLiimatta, MLockey, PNorman, MOuyang, WRené, OWong, H Structure-based design of substituted hexafluoroisopropanol-arylsulfonamides as modulators of RORc. Bioorg Med Chem Lett 23:6604-9 (2013)  
Target
Name:
Nuclear receptor ROR-gamma
Synonyms:
NR1F3 Nuclear receptor ROR-gamma (RORC) RAR-related orphan receptor C (RORc) RORG RZRG Retinoid-related orphan receptor-gamma (RORc)
Type:
Enzyme Catalytic Domain
Mol. Mass.:
58218.40
Organism:
Homo sapiens (Human)
Description:
P51449
Residue:
518
  
Inhibitor
Name:
BDBM50444338
Synonyms:
CHEMBL3094388
Type:
Small organic molecule
Emp. Form.:
C15H13F6N3O4S2
Mol. Mass.:
477.402
SMILES:
CC(=O)Nc1nc(C)c(s1)S(=O)(=O)Nc1ccc(cc1)C(O)(C(F)(F)F)C(F)(F)F
: