Target
Cytochrome P450 11B1, mitochondrial
Ligand
BDBM50444549
Substrate
Meas. Tech.
ChEMBL_1281887 (CHEMBL3101040)
IC50
2.5±n/a nM
Citation
 Meredith, ELKsander, GMonovich, LGPapillon, JPLiu, QMiranda, KMorris, PRao, CBurgis, RCapparelli, MHu, QYSingh, ARigel, DFJeng, AYBeil, MFu, FHu, CWLaSala, D Discovery and in Vivo Evaluation of Potent Dual CYP11B2 (Aldosterone Synthase) and CYP11B1 Inhibitors. ACS Med Chem Lett 4:1203-7 (2013)  
Target
Name:
Cytochrome P450 11B1, mitochondrial
Synonyms:
C11B1_HUMAN CYPXIB1 Cytochrome P450 11B1 Cytochrome P450 11B1, mitochondrial | S11BH
Type:
Enzyme
Mol. Mass.:
57591.44
Organism:
Homo sapiens (Human)
Description:
P15538
Residue:
503
  
Inhibitor
Name:
BDBM50444549
Synonyms:
CHEMBL3099695
Type:
Small organic molecule
Emp. Form.:
C13H10FN3
Mol. Mass.:
227.237
SMILES:
Fc1cc(ccc1[C@H]1CCc2cncn12)C#N
: