Target
Cytochrome P450 11B1, mitochondrial
Ligand
BDBM50444550
Substrate
Meas. Tech.
ChEMBL_1281887 (CHEMBL3101040)
IC50
0.300000±n/a nM
Citation
 Meredith, ELKsander, GMonovich, LGPapillon, JPLiu, QMiranda, KMorris, PRao, CBurgis, RCapparelli, MHu, QYSingh, ARigel, DFJeng, AYBeil, MFu, FHu, CWLaSala, D Discovery and in Vivo Evaluation of Potent Dual CYP11B2 (Aldosterone Synthase) and CYP11B1 Inhibitors. ACS Med Chem Lett 4:1203-7 (2013)  
Target
Name:
Cytochrome P450 11B1, mitochondrial
Synonyms:
C11B1_HUMAN CYPXIB1 Cytochrome P450 11B1 Cytochrome P450 11B1, mitochondrial | S11BH
Type:
Enzyme
Mol. Mass.:
57591.44
Organism:
Homo sapiens (Human)
Description:
P15538
Residue:
503
  
Inhibitor
Name:
BDBM50444550
Synonyms:
CHEMBL3099704
Type:
Small organic molecule
Emp. Form.:
C21H18FN3
Mol. Mass.:
331.3861
SMILES:
Fc1ccc(cc1)-c1cc(ccc1[C@H]1CCCCc2cncn12)C#N
: