Target
D(2) dopamine receptor
Ligand
BDBM50444830
Substrate
Meas. Tech.
ChEMBL_1282321 (CHEMBL3100268)
EC50
0.140000±n/a nM
Citation
 Risgaard, RJensen, MJørgensen, MBang-Andersen, BChristoffersen, CTJensen, KGKristensen, JLPüschl, A Synthesis and SAR study of a novel series of dopamine receptor agonists. Bioorg Med Chem 22:381-92 (2013)  
Target
Name:
D(2) dopamine receptor
Synonyms:
D(2) dopamine receptor DOPAMINE D2 Long DRD2 Dopamine D2 receptor Dopamine D2 receptor (D2R) Dopamine2-like | d2
Type:
Cell-surface receptors
Mol. Mass.:
50647.10
Organism:
Homo sapiens (Human)
Description:
P14416
Residue:
443
  
Inhibitor
Name:
BDBM50444830
Synonyms:
CHEMBL3099226
Type:
Small organic molecule
Emp. Form.:
C15H21NO2
Mol. Mass.:
247.3327
SMILES:
CCCN1CCO[C@@H]2Cc3c(O)cccc3C[C@@H]12
: