Target
Egl nine homolog 1
Ligand
BDBM50446897
Substrate
Meas. Tech.
ChEMBL_1290297 (CHEMBL3118619)
IC50
1.5±n/a nM
Citation
 Rabinowitz, MH Inhibition of hypoxia-inducible factor prolyl hydroxylase domain oxygen sensors: tricking the body into mounting orchestrated survival and repair responses. J Med Chem 56:9369-402 (2014)  
Target
Name:
Egl nine homolog 1
Synonyms:
C1orf12 EGLN1_HUMAN Hypoxia-inducible factor prolyl hydroxylase 2 (HIF-PH2) Prolyl hydroxylase domain-containing protein 2 (PHD2)
Type:
Protein
Mol. Mass.:
46035.59
Organism:
Homo sapiens (Human)
Description:
Q9GZT9
Residue:
426
  
Inhibitor
Name:
BDBM50446897
Synonyms:
CHEMBL3115302
Type:
Small organic molecule
Emp. Form.:
C17H13FN4O5
Mol. Mass.:
372.3073
SMILES:
Cn1c2nc(ncc2c(O)c(C(=O)NCC(O)=O)c1=O)-c1ccccc1F
: