Target
Oxoeicosanoid receptor 1
Ligand
BDBM50269535
Substrate
Meas. Tech.
ChEMBL_1290745 (CHEMBL3117757)
IC50
2000±n/a nM
Citation
 Gore, VGravel, SCossette, CPatel, PChourey, SYe, QRokach, JPowell, WS Inhibition of 5-oxo-6,8,11,14-eicosatetraenoic acid-induced activation of neutrophils and eosinophils by novel indole OXE receptor antagonists. J Med Chem 57:364-77 (2014)  
Target
Name:
Oxoeicosanoid receptor 1
Synonyms:
5-oxo-ETE G-protein coupled receptor G-protein coupled receptor R527 GPR170 OXER1_HUMAN TG 1019 | TG1019
Type:
Enzyme Catalytic Domain
Mol. Mass.:
45833.20
Organism:
Homo sapiens (Human)
Description:
TG 1019 0 HUMAN::Q8TDS5
Residue:
423
  
Inhibitor
Name:
BDBM50269535
Synonyms:
(11Z,14Z,17Z)-Eicosa-11,14,17-trienoic acid (Z,Z,Z)-11,14,17-eicosatrienoic acid 11,14,17-Icosatrienoic acid ETA eicosatrienoic acid
Type:
Small organic molecule
Emp. Form.:
C20H34O2
Mol. Mass.:
306.4828
SMILES:
CC\C=C/C\C=C/C\C=C/CCCCCCCCCC(O)=O
: