Target
Serine/threonine-protein kinase mTOR
Ligand
BDBM50380313
Substrate
Meas. Tech.
ChEMBL_1289435 (CHEMBL3116931)
IC50
7.9±n/a nM
Citation
 Lin, SHan, FLiu, PTao, JZhong, XLiu, XYi, CXu, H Identification of novel 7-amino-5-methyl-1,6-naphthyridin-2(1H)-one derivatives as potent PI3K/mTOR dual inhibitors. Bioorg Med Chem Lett 24:790-3 (2014)  
Target
Name:
Serine/threonine-protein kinase mTOR
Synonyms:
FK506-binding protein 12-rapamycin complex-associated protein 1 FRAP FRAP1 MTOR Mammalian Target of Rapamycin (mTOR) RAFT1 Rapamycin and FKBP12 target 1 Serine/threonine-protein kinase (mTOR) | mTORC2
Type:
Rapamycin target protein
Mol. Mass.:
288917.12
Organism:
Homo sapiens (Human)
Description:
P42345
Residue:
2549
  
Inhibitor
Name:
BDBM50380313
Synonyms:
CHEMBL1234354 | US8633204, 286
Type:
Small organic molecule
Emp. Form.:
C22H27N5O4
Mol. Mass.:
425.4809
SMILES:
COc1ccc(cn1)-c1cc2c(C)nc(N)nc2n([C@H]2CC[C@@H](CC2)OCCO)c1=O
: