Target
Fatty-acid amide hydrolase 1
Ligand
BDBM50447663
Substrate
Meas. Tech.
ChEMBL_1289464 (CHEMBL3117158)
IC50
260±n/a nM
Citation
 Keith, JMJones, WMPierce, JMSeierstad, MPalmer, JAWebb, MKarbarz, MJScott, BPWilson, SJLuo, LWennerholm, MLChang, LBrown, SMRizzolio, MRynberg, RChaplan, SRBreitenbucher, JG Heteroarylureas with spirocyclic diamine cores as inhibitors of fatty acid amide hydrolase. Bioorg Med Chem Lett 24:737-41 (2014)  
Target
Name:
Fatty-acid amide hydrolase 1
Synonyms:
Anandamide amidohydrolase FAAH FAAH1_HUMAN Fatty-acid amide hydrolase (FAAH) Oleamide hydrolase 1
Type:
Protein
Mol. Mass.:
63071.19
Organism:
Homo sapiens (Human)
Description:
O00519
Residue:
579
  
Inhibitor
Name:
BDBM50447663
Synonyms:
CHEMBL3112950
Type:
Small organic molecule
Emp. Form.:
C25H26ClN5O2
Mol. Mass.:
463.959
SMILES:
Clc1ccc(Oc2cccc(CN3CCC4(CN(C4)C(=O)Nc4cccnn4)CC3)c2)cc1
: