Target
Glucose-dependent insulinotropic receptor
Ligand
BDBM50447712
Substrate
Meas. Tech.
ChEMBL_1289704 (CHEMBL3118588)
EC50
290±n/a nM
Citation
 Wang, YYu, MZhu, JZhang, JKKayser, FMedina, JCSiegler, KConn, MShan, BGrillo, MPLiu, JJCoward, P Discovery and optimization of 5-(2-((1-(phenylsulfonyl)-1,2,3,4-tetrahydroquinolin-7-yl)oxy)pyridin-4-yl)-1,2,4-oxadiazoles as novel gpr119 agonists. Bioorg Med Chem Lett 24:1133-7 (2014)  
Target
Name:
Glucose-dependent insulinotropic receptor
Synonyms:
G-protein coupled receptor 119 (GPR119) GPR119 | Glucose-dependent insulinotropic receptor
Type:
Protein
Mol. Mass.:
36901.49
Organism:
Homo sapiens (Human)
Description:
Q8TDV5
Residue:
335
  
Inhibitor
Name:
BDBM50447712
Synonyms:
CHEMBL3113004
Type:
Small organic molecule
Emp. Form.:
C25H21ClN4O4S
Mol. Mass.:
508.977
SMILES:
Clc1cc(cc(Oc2ccc3CCCN(c3c2)S(=O)(=O)c2ccccc2)n1)-c1nc(no1)C1CC1
: